{"text_format":"1","workbook":"xlsx","n_sheets":6,"sheets":["Settings","Aktivera makron","Lösenordssida","Foderstatsberäkning Lamm","Data","Fodermedelstabell"],"not_rendered":{"charts":0,"images":2,"macros":1,"external_links":0,"defined_names":9,"comments":1,"pivot_tables":0},"unopened":[],"bounds":{"document_bytes":16777216,"sheet_cells":100000,"rows_first":2000,"rows_last":500,"rows_between":2000,"halvings":0,"cell_chars":16384,"cell_head_chars":4096},"cells_cut":0,"cells_raw":0,"read":"whole","date_system":"1900"}

{"sheet":"Settings","index":0,"n_rows":33,"n_cols":5,"rows_kept":33,"cut":false,"hidden":true,"merged":[[26,1,27,2],[32,1,33,2],[21,1,22,2]]}
[]
[null,"ActiveSheet on save","Foderstatsberäkning Lamm"]
[null,"Save events on",true,null,"Styr så att arbetsboken inte kan sparas utan att dölja alla blad och visa splash-skärmen"]
[null,"Open events on",true,null,"Styr så att splashskärmen döljs, alla andra blad visas och licens kontrolleras"]
[]
[null,"Makroversion","2022-04-26",null,"Version på makrona från SPVK Konsult AB"]
[]
[null,"Licensdatum","2024-12-31",null,"Efter detta datum kommer alla flikar att skrivskyddas"]
[]
[null,"Licensägare",{"$f":"Lösenordssida!A2","v":"Branchutvecklingspeng"},null,"Fyll i namn/företag. Kommer användas i licensmeddelande när man öppnar filen och aktiverar makron."]
[]
[null,"Lösenord","0000",null,"Tillämpas för att skydda blad och arbetsboksstruktur"]
[]
[]
[]
{"$rows_left_out":19}
{"sheet":"Aktivera makron","index":1,"n_rows":13,"n_cols":15,"rows_kept":13,"cut":false,"hidden":false,"merged":[[8,2,8,13]]}
[]
[]
[]
[]
[]
[]
[null,null,"Du behöver aktivera makron för att komma åt innehållet i denna fil."]
[]
[null,null,"Här finns hjälp hur du gör detta."]
[]
[null,null,"(När makron aktiveras så försvinner denna bild och innehållet i filen visas)",null,null,null,null,null,null,null,null,null,null,null,{"$f":"Lösenordssida!$C$2","v":"Theo den Braver, Gård & Djurhälsan"}]
[null,null,null,null,null,null,null,null,null,null,null,null,null,null,{"$f":"Lösenordssida!$C$3","v":"theo.denbraver@gardochdjurhalsan.se"}]
[null,null,null,null,null,null,null,null,null,null,null,null,null,null,{"$f":"Lösenordssida!$C$4","v":"070-3933089"}]

{"sheet":"Lösenordssida","index":2,"n_rows":4,"n_cols":3,"rows_kept":4,"cut":false,"hidden":true,"merged":[]}
[null,null,"Grunduppgifter Rådgivare"]
["Branchutvecklingspeng",null,"Theo den Braver, Gård & Djurhälsan"]
[null,null,"theo.denbraver@gardochdjurhalsan.se"]
[null,null,"070-3933089"]

{"sheet":"Foderstatsberäkning Lamm","index":3,"n_rows":42,"n_cols":30,"rows_kept":42,"cut":false,"hidden":true,"merged":[[33,7,33,8],[33,13,33,14],[33,19,33,20],[33,25,33,26],[2,9,2,10],[3,9,3,10],[4,9,4,10],[5,9,5,10]]}
["Foderberäkningsprogram för växande Lamm. Finansierat av Branchutvecklingspengar 2022."]
["De mörgröna cellerna är redigerbara, fyll i värden som grund för beräkningen.",null,null,null,null,null,"Växande lamm",null,null,"Aktuell Vikt",null,null,"Konc","Kons","Energi","AAT","Ca","P","K","Mg","E-Vit","Na","S","Se","Cu","Co","Mo","Fe","Mn","Zn"]
["Du ljusbruna cellerna skapa resultat av beräkningarna",null,null,null,null,null,"Viktgrp 15-25 kg Medel 20 kg",null,null,"g/dag  (100-400) ",null,0,{"$f":"IF(L3=\"\",\"\",VLOOKUP(L3,Data!$B$9:$T$16,3,FALSE))","v":0},{"$f":"IF(L3=\"\",\"\",VLOOKUP(L3,Data!$B$9:$T$16,2,FALSE))","v":0},{"$f":"IF(L3=\"\",\"\",VLOOKUP(L3,Data!$B$9:$T$16,4,FALSE))","v":0},{"$f":"IF(L3=\"\",\"\",VLOOKUP(L3,Data!$B$9:$T$16,5,FALSE))","v":0},{"$f":"IF(L3=\"\",\"\",VLOOKUP(L3,Data!$B$9:$T$16,6,FALSE))","v":0},{"$f":"IF(L3=\"\",\"\",VLOOKUP(L3,Data!$B$9:$T$16,7,FALSE))","v":0},{"$f":"IF(L3=\"\",\"\",VLOOKUP(L3,Data!$B$9:$T$16,8,FALSE))","v":0},{"$f":"IF(L3=\"\",\"\",VLOOKUP(L3,Data!$B$9:$T$16,9,FALSE))","v":0},{"$f":"IF(L3=\"\",\"\",VLOOKUP(L3,Data!$B$9:$T$16,10,FALSE))","v":0},{"$f":"IF(L3=\"\",\"\",VLOOKUP(L3,Data!$B$9:$T$16,11,FALSE))","v":0},{"$f":"IF(L3=\"\",\"\",VLOOKUP(L3,Data!$B$9:$T$16,12,FALSE))","v":0},{"$f":"IF(L3=\"\",\"\",VLOOKUP(L3,Data!$B$9:$T$16,13,FALSE))","v":0},{"$f":"IF(L3=\"\",\"\",VLOOKUP(L3,Data!$B$9:$T$16,14,FALSE))","v":0},{"$f":"IF(L3=\"\",\"\",VLOOKUP(L3,Data!$B$9:$T$16,15,FALSE))","v":0},{"$f":"IF(L3=\"\",\"\",VLOOKUP(L3,Data!$B$9:$T$16,16,FALSE))","v":0},{"$f":"IF(L3=\"\",\"\",VLOOKUP(L3,Data!$B$9:$T$16,17,FALSE))","v":0},{"$f":"IF(L3=\"\",\"\",VLOOKUP(L3,Data!$B$9:$T$16,18,FALSE))","v":0},{"$f":"IF(L3=\"\",\"\",VLOOKUP(L3,Data!$B$9:$T$16,19,FALSE))","v":0}]
["I de gråa fälten hittar du behovsnormer och analysvärden för fodermedel",null,null,null,null,null,"Viktgrp 25-35 kg Medel 30 kg",null,null,"g/dag  (200-500)",null,0,{"$f":"IF(L4=\"\",\"\",VLOOKUP(L4,Data!$B$18:$T$96025,3,FALSE))","v":0},{"$f":"IF(L4=\"\",\"\",VLOOKUP(L4,Data!$B$18:$T$96025,2,FALSE))","v":0},{"$f":"IF(L4=\"\",\"\",VLOOKUP(L4,Data!$B$18:$T$96025,4,FALSE))","v":0},{"$f":"IF(L4=\"\",\"\",VLOOKUP(L4,Data!$B$18:$T$96025,5,FALSE))","v":0},{"$f":"IF(L4=\"\",\"\",VLOOKUP(L4,Data!$B$18:$T$96025,6,FALSE))","v":0},{"$f":"IF(L4=\"\",\"\",VLOOKUP(L4,Data!$B$18:$T$96025,7,FALSE))","v":0},{"$f":"IF(L4=\"\",\"\",VLOOKUP(L4,Data!$B$18:$T$96025,8,FALSE))","v":0},{"$f":"IF(L4=\"\",\"\",VLOOKUP(L4,Data!$B$18:$T$96025,9,FALSE))","v":0},{"$f":"IF(L4=\"\",\"\",VLOOKUP(L4,Data!$B$18:$T$96025,10,FALSE))","v":0},{"$f":"IF(L4=\"\",\"\",VLOOKUP(L4,Data!$B$18:$T$96025,11,FALSE))","v":0},{"$f":"IF(L4=\"\",\"\",VLOOKUP(L4,Data!$B$18:$T$96025,12,FALSE))","v":0},{"$f":"IF(L4=\"\",\"\",VLOOKUP(L4,Data!$B$18:$T$96025,13,FALSE))","v":0},{"$f":"IF(L4=\"\",\"\",VLOOKUP(L4,Data!$B$18:$T$96025,14,FALSE))","v":0},{"$f":"IF(L4=\"\",\"\",VLOOKUP(L4,Data!$B$18:$T$96025,15,FALSE))","v":0},{"$f":"IF(L4=\"\",\"\",VLOOKUP(L4,Data!$B$18:$T$96025,16,FALSE))","v":0},{"$f":"IF(L4=\"\",\"\",VLOOKUP(L4,Data!$B$18:$T$96025,17,FALSE))","v":0},{"$f":"IF(L4=\"\",\"\",VLOOKUP(L4,Data!$B$18:$T$96025,18,FALSE))","v":0},{"$f":"IF(L4=\"\",\"\",VLOOKUP(L4,Data!$B$18:$T$96025,19,FALSE))","v":0}]
["Arbetsgång",null,null,null,null,null,"Viktgrp 35-45 kg medel 40 kg",null,null,"g/dag  (200-500)",null,0,{"$f":"IF(L5=\"\",\"\",VLOOKUP(L5,Data!$B$27:$T$34,3,FALSE))","v":0},{"$f":"IF(L5=\"\",\"\",VLOOKUP(L5,Data!$B$27:$T$34,2,FALSE))","v":0},{"$f":"IF(L5=\"\",\"\",VLOOKUP(L5,Data!$B$27:$T$34,4,FALSE))","v":0},{"$f":"IF(L5=\"\",\"\",VLOOKUP(L5,Data!$B$27:$T$34,5,FALSE))","v":0},{"$f":"IF(L5=\"\",\"\",VLOOKUP(L5,Data!$B$27:$T$34,6,FALSE))","v":0},{"$f":"IF(L5=\"\",\"\",VLOOKUP(L5,Data!$B$27:$T$34,7,FALSE))","v":0},{"$f":"IF(L5=\"\",\"\",VLOOKUP(L5,Data!$B$27:$T$34,8,FALSE))","v":0},{"$f":"IF(L5=\"\",\"\",VLOOKUP(L5,Data!$B$27:$T$34,9,FALSE))","v":0},{"$f":"IF(L5=\"\",\"\",VLOOKUP(L5,Data!$B$27:$T$34,10,FALSE))","v":0},{"$f":"IF(L5=\"\",\"\",VLOOKUP(L5,Data!$B$27:$T$34,11,FALSE))","v":0},{"$f":"IF(L5=\"\",\"\",VLOOKUP(L5,Data!$B$27:$T$34,12,FALSE))","v":0},{"$f":"IF(L5=\"\",\"\",VLOOKUP(L5,Data!$B$27:$T$34,13,FALSE))","v":0},{"$f":"IF(L5=\"\",\"\",VLOOKUP(L5,Data!$B$27:$T$34,14,FALSE))","v":0},{"$f":"IF(L5=\"\",\"\",VLOOKUP(L5,Data!$B$27:$T$34,15,FALSE))","v":0},{"$f":"IF(L5=\"\",\"\",VLOOKUP(L5,Data!$B$27:$T$34,16,FALSE))","v":0},{"$f":"IF(L5=\"\",\"\",VLOOKUP(L5,Data!$B$27:$T$34,17,FALSE))","v":0},{"$f":"IF(L5=\"\",\"\",VLOOKUP(L5,Data!$B$27:$T$34,18,FALSE))","v":0},{"$f":"IF(L5=\"\",\"\",VLOOKUP(L5,Data!$B$27:$T$34,19,FALSE))","v":0}]
["1.Fyll i aktuell genomsnittsvikt för utfodringsgruppen",null,null,null,null,null,"Viktgrp 45-55 kg Medel 50 kg",null,null,"g/dag  (200-500)",null,0,{"$f":"IF(L6=\"\",\"\",VLOOKUP(L6,Data!$B$36:$T$43,3,FALSE))","v":0},{"$f":"IF(L6=\"\",\"\",VLOOKUP(L6,Data!$B$36:$T$43,2,FALSE))","v":0},{"$f":"IF(L6=\"\",\"\",VLOOKUP(L6,Data!$B$36:$T$43,4,FALSE))","v":0},{"$f":"IF(L6=\"\",\"\",VLOOKUP(L6,Data!$B$36:$T$43,5,FALSE))","v":0},{"$f":"IF(L6=\"\",\"\",VLOOKUP(L6,Data!$B$36:$T$43,6,FALSE))","v":0},{"$f":"IF(L6=\"\",\"\",VLOOKUP(L6,Data!$B$36:$T$43,7,FALSE))","v":0},{"$f":"IF(L6=\"\",\"\",VLOOKUP(L6,Data!$B$36:$T$43,8,FALSE))","v":0},{"$f":"IF(L6=\"\",\"\",VLOOKUP(L6,Data!$B$36:$T$43,9,FALSE))","v":0},{"$f":"IF(L6=\"\",\"\",VLOOKUP(L6,Data!$B$36:$T$43,10,FALSE))","v":0},{"$f":"IF(L6=\"\",\"\",VLOOKUP(L6,Data!$B$36:$T$43,11,FALSE))","v":0},{"$f":"IF(L6=\"\",\"\",VLOOKUP(L6,Data!$B$36:$T$43,12,FALSE))","v":0},{"$f":"IF(L6=\"\",\"\",VLOOKUP(L6,Data!$B$36:$T$43,13,FALSE))","v":0},{"$f":"IF(L6=\"\",\"\",VLOOKUP(L6,Data!$B$36:$T$43,14,FALSE))","v":0},{"$f":"IF(L6=\"\",\"\",VLOOKUP(L6,Data!$B$36:$T$43,15,FALSE))","v":0},{"$f":"IF(L6=\"\",\"\",VLOOKUP(L6,Data!$B$36:$T$43,16,FALSE))","v":0},{"$f":"IF(L6=\"\",\"\",VLOOKUP(L6,Data!$B$36:$T$43,17,FALSE))","v":0},{"$f":"IF(L6=\"\",\"\",VLOOKUP(L6,Data!$B$36:$T$43,18,FALSE))","v":0},{"$f":"IF(L6=\"\",\"\",VLOOKUP(L6,Data!$B$36:$T$43,19,FALSE))","v":0}]
["2, Fyll i planerad tillväxt för aktuell viktgrupp",null,null,null,null,null,null,null,null,null,null,0,"Normer för växande lamm NRC 2007 Sammanställt samt estimerat av Theo den Braver"]
["3. fyll i antal djur"]
["4.Fyll i antal planerade dagar i gruppen"]
["5. Ange fodermedelsnummer för ingående fodermedel, se flik \"Fodermedelstabell\""]
["6. Beräkna: Målet är 100-120 % på Mj och AAT med rätt konsumtions mängd",null,null,null,null,null,"Antal Djur",null,null,null,"st",null,{"$f":"SUM(M3:M10)","v":0},0,0,0,0,0,0,0,0,0,0,0,0,0,0,0,0,0]
["7. Tryck ctrl + P för utskrift",null,null,null,null,null,"Tid i aktuell viktgrupp",null,{"$f":"10/((L3+L4+L5+L6)/1000)","v":{"$error":"#DIV/0!"}},"Dagar",null,null,"Dagar"]
[null,{"$f":"G2","v":"Växande lamm"}]
[]
[null,"Tot kg i Perioden","Tot kg i Besättningen","Giva kgts/dag","Giva kg/dag","Namn                                                                                        FODERMEDEL","Foder nummer",{"$f":"Fodermedelstabell!D2","v":"Pris kr/kgts"},{"$f":"Fodermedelstabell!E2","v":"Ts %"},{"$f":"Fodermedelstabell!F2","v":"Energi MJ/kgts"},{"$f":"Fodermedelstabell!G2","v":"Råprot\nRp/kgts"},{"$f":"Fodermedelstabell!H2","v":"NDF \ng/kgts"},{"$f":"Fodermedelstabell!I2","v":"AAT g/kgts"},{"$f":"Fodermedelstabell!J2","v":"PBV g/kgts"},{"$f":"Fodermedelstabell!K2","v":"Stärk g/kgts"},{"$f":"Fodermedelstabell!L2","v":"Råfett g/kgts"},{"$f":"Fodermedelstabell!M2","v":"Ca\ng/kgts"},{"$f":"Fodermedelstabell!N2","v":"P\ng/kgts"},{"$f":"Fodermedelstabell!O2","v":"K\ng/kgts"},{"$f":"Fodermedelstabell!P2","v":"Mg\ng/kgts"},{"$f":"Fodermedelstabell!Q2","v":"E vit g/kgts"},{"$f":"Fodermedelstabell!R2","v":"Na\ng/kgts"},{"$f":"Fodermedelstabell!S2","v":"S\ng/kgts"},{"$f":"Fodermedelstabell!T2","v":"Se\nmg/kgts"},{"$f":"Fodermedelstabell!U2","v":"Cu mg/kgts"},{"$f":"Fodermedelstabell!V2","v":"Co\nmg/kgts"},{"$f":"Fodermedelstabell!W2","v":"Mo\nmg/kgts"},{"$f":"Fodermedelstabell!X2","v":"Fe\nmg/kgts"},{"$f":"Fodermedelstabell!Y2","v":"Mn \nmg/kgts"},{"$f":"Fodermedelstabell!Z2","v":"Zn mg/kgts"}]
{"$rows_left_out":28}
{"sheet":"Data","index":4,"n_rows":43,"n_cols":20,"rows_kept":43,"cut":false,"hidden":true,"merged":[]}
[]
[]
[null,"Underhållsbehovs normer för får / dag"]
[null,null,null,null,"Energi","AAT","Ca","P","K","Mg","E-Vit","Na","S","Se (Krf Diet)","Cu","Co","Mo","Fe","Mn","Zn"]
[null,"vikt",null,null,"Mj","g/dag","g/kgts","g/kgts","g/kgts","g/kgts",null,"g/kgts","g/kgts","mg/kgts","mg/kgts","mg/kgts","mg/kgts","mg/kgts","mg/kgts","mg/kgts"]
[null,1,2,3,4,5,6,7,8,9,10,11,12,13,14,15,16,17,18,19]
["Rekomendationer Nrc 2007 tab 15-2 samt 15-3 samt estimat av Theo"]
["Vikt","Tillväxt","Kons, förmåga\nTab15-3 NRC 2007"," Konc grad\nMj/kg ts","Behov\n Mj/dag","Behov \nAAT g/dag","Behov\n Ca g/dag","Behov\n P g/dag","Behov\n K g/dag","Behov\n Mg g/dag","Behov\n E vit IE/dag","Behov\n Na g/dag","Behov\n S g/dag","Behov (Kfr Diet)\n Se g/dag","Behov\n Cu g/dag","Behov\n Co g/dag","Behov\n Mo g/dag","Behov\n Fe g/dag","Behov\n Mn g/dag","Behov\n Zn g/dag"]
["-",0,0,0,0,0,0,0,0,0,0,0,0,0,0,0,0,0,0,0]
[20,100,0.63,9.1368100000000005,6.1175400000000009,48.469107241037065,2.1500000000000004,1.5,2.9,0.6,200,0.4,1.1000000000000001,0.09,3.1,0.13,null,32,12,13]
[20,150,0.74,9.70181,8.0175899999999984,61.969107241037065,2.8500000000000005,2.1,3.3,0.7,200,0.4,1.3,0.13,4,0.15,null,46,15,17]
[20,200,0.82,10.22681,9.5342900000000004,75.469107241037065,3.5500000000000007,2.7,3.6,0.8,200,0.5,1.5,0.18,4.9000000000000004,0.16,null,61,18,21]
[20,250,0.94,10.72681,11.3,88.969107241037065,4.2500000000000009,3.3000000000000003,4.2,0.9,200,0.5,1.7,0.22,5.8,0.18,null,76,21,25]
[20,300,1.0900000000000001,11.19181,13.064539999999999,102.46910724103707,4.9500000000000011,3.9000000000000004,4.5999999999999996,1,200,0.6,2,0.26,6.6,0.22,null,90,24,29]
[20,350,1.21,11.616810000000001,14.829079999999998,115.96910724103707,5.6500000000000012,4.5,5,1.1000000000000001,200,0.6,2.1,0.28000000000000003,7.5,0.24,null,104,27,33]
{"$rows_left_out":29}
{"sheet":"Fodermedelstabell","index":5,"n_rows":338,"n_cols":26,"rows_kept":338,"cut":false,"hidden":true,"merged":[]}
[null,2,3,4,5,6,7,8,9,10,11,12,13,14,15,16,17,18,19,20,21,22,23,24,25,26]
["Nr","Namn","Firma","Pris kr/kgts","Ts %","Energi MJ/kgts","Råprot\nRp/kgts","NDF \ng/kgts","AAT g/kgts","PBV g/kgts","Stärk g/kgts","Råfett g/kgts","Ca\ng/kgts","P\ng/kgts","K\ng/kgts","Mg\ng/kgts","E vit g/kgts","Na\ng/kgts","S\ng/kgts","Se\nmg/kgts","Cu mg/kgts","Co\nmg/kgts","Mo\nmg/kgts","Fe\nmg/kgts","Mn \nmg/kgts","Zn mg/kgts"]
["-","-",null,null,0,0,0,0,0,0,0,0,0,0,0,0,0,0,0,0,0,0,0,0,0,0]
[0,0,null,null,0,0,0,0,0,0,0,0,0,0,0,0,0,0,0,0,0,0,0,0,0,0]
[1,"TOPMILK                             ",null,null,96,17,209,0,0,0,0,136,7.8,7.1,0,1.2,0,0,0,0,0,null,null,null,0,0]
[2,"Åkerbete försommar             ",null,null,20,11,190,480,80,52,0,20,4.5,2.4,22,1.5,120,0.33,1.1000000000000001,1.4E-2,5.9,2.1000000000000001E-2,3.1,65,73,26]
[3,"Åkerbete Högsommar",null,null,20,10.5,170,510,78,36,0,20,4.5,2.4,22,1.5,120,0.33,1.1000000000000001,1.4E-2,5.9,2.1000000000000001E-2,3.1,65,73,26]
[4,"BETE ÅKERM SENSOMMAR                ","                    ",null,20,10.8,210,470,78,74,0,20,5.5,3,0,0,0,0,0,0,0,null,null,null,0,0]
[5,"BETE ÅKERM FÖRVUXET FÖRSOMMAR       ","                    ",null,20,10.1,92,540,76,-38,0,20,5.5,3,0,0,0,0,0,0,0,null,null,null,0,0]
[6,"Vinterbete","                    ",null,20,8,90,585,66,-14,0,20,4.5,2.4,22,1.5,0,0.33,1.1000000000000001,1.4E-2,5.9,2.1000000000000001E-2,3.1,65,73,26]
[7,"Åkerbete vår     ","                    ",null,20,11,140,400,82,40,0,20,4.5,2.4,22,1.5,200,0.33,1.1000000000000001,1.4E-2,5.9,2.1000000000000001E-2,3.1,65,73,26]
[15,"Norm bete Frisk medel",null,null,20,9.6999999999999993,140,560,69,18,null,null,5.5,3]
[16,"Norm bete Frisk Försommar",null,null,20,10.5,150,500,69,18,null,null,5.5,3]
[17,"Norm bete Frisk Högsommar",null,null,20,9.5,140,530,69,18,null,null,5.5,3]
[18,"Norm bete Frisk Sensommar",null,null,20,9,130,560,69,18,null,null,5.5,3]
{"$rows_left_out":323}